Target
Carbonic anhydrase 9
Ligand
BDBM50279706
Substrate
Meas. Tech.
ChEMBL_1721603 (CHEMBL4136603)
Ki
2.3±n/a nM
Citation
 Angeli, ATanini, DCapperucci, ASupuran, CT Synthesis of Novel Selenides Bearing Benzenesulfonamide Moieties as Carbonic Anhydrase I, II, IV, VII, and IX Inhibitors. ACS Med Chem Lett 8:1213-1217 (2017)  
Target
Name:
Carbonic anhydrase 9
Synonyms:
CA-IX CAH9_HUMAN Carbonic anhydrase 9 (CA IX) Carbonic anhydrase 9 precursor Carbonic anhydrase IX (CAIX) Carbonic anhydrases; II & IX MN RCC-associated antigen G250
Type:
Enzyme
Mol. Mass.:
49669.03
Organism:
Homo sapiens (Human)
Description:
Catalytic domain of human cloned isozyme was used in the assay
Residue:
459
  
Inhibitor
Name:
BDBM50279706
Synonyms:
CHEMBL4165963
Type:
Small organic molecule
Emp. Form.:
C16H26N2O4SSe
Mol. Mass.:
421.41
SMILES:
[#6]-[#6](-[#6])-[#6@@H](-[#6][Se;v2]c1ccc(cc1)S([#7])(=O)=O)-[#7]-[#6](=O)-[#8]C([#6])([#6])[#6]
: