Target
Carbonic anhydrase 2
Ligand
BDBM50279711
Substrate
Meas. Tech.
ChEMBL_1721600 (CHEMBL4136600)
Ki
4.9±n/a nM
Citation
 Angeli, ATanini, DCapperucci, ASupuran, CT Synthesis of Novel Selenides Bearing Benzenesulfonamide Moieties as Carbonic Anhydrase I, II, IV, VII, and IX Inhibitors. ACS Med Chem Lett 8:1213-1217 (2017)  
Target
Name:
Carbonic anhydrase 2
Synonyms:
CA-II CAC Carbonate dehydratase II Carbonic anhydrase 2 (CA-II) Carbonic anhydrase C Carbonic anhydrase II (CA-II) Carbonic anhydrase II (hCA II) | Carbonic anhydrase isoenzyme II (hCA II)
Type:
Enzyme
Mol. Mass.:
29250.71
Organism:
Homo sapiens (Human)
Description:
P00918
Residue:
260
  
Inhibitor
Name:
BDBM50279711
Synonyms:
CHEMBL4174268
Type:
Small organic molecule
Emp. Form.:
C9H12BrNO3SSe
Mol. Mass.:
373.13
SMILES:
[#7]S(=O)(=O)c1ccc([Se;v2][#6]-[#6](-[#8])-[#6]Br)cc1
: