Target
Carbonic anhydrase 2
Ligand
BDBM50279707
Substrate
Meas. Tech.
ChEMBL_1721600 (CHEMBL4136600)
Ki
1.4±n/a nM
Citation
 Angeli, ATanini, DCapperucci, ASupuran, CT Synthesis of Novel Selenides Bearing Benzenesulfonamide Moieties as Carbonic Anhydrase I, II, IV, VII, and IX Inhibitors. ACS Med Chem Lett 8:1213-1217 (2017)  
Target
Name:
Carbonic anhydrase 2
Synonyms:
CA-II CAC Carbonate dehydratase II Carbonic anhydrase 2 (CA-II) Carbonic anhydrase C Carbonic anhydrase II (CA-II) Carbonic anhydrase II (hCA II) | Carbonic anhydrase isoenzyme II (hCA II)
Type:
Enzyme
Mol. Mass.:
29250.71
Organism:
Homo sapiens (Human)
Description:
P00918
Residue:
260
  
Inhibitor
Name:
BDBM50279707
Synonyms:
CHEMBL4174548
Type:
Small organic molecule
Emp. Form.:
C16H19NO4SSe
Mol. Mass.:
400.35
SMILES:
[#7]S(=O)(=O)c1ccc([Se;v2][#6]-[#6](-[#8])-[#6]-[#8]-[#6]-c2ccccc2)cc1
: