Target
Carbonic anhydrase 7
Ligand
BDBM50279712
Substrate
Meas. Tech.
ChEMBL_1721602 (CHEMBL4136602)
Ki
0.770000±n/a nM
Citation
 Angeli, ATanini, DCapperucci, ASupuran, CT Synthesis of Novel Selenides Bearing Benzenesulfonamide Moieties as Carbonic Anhydrase I, II, IV, VII, and IX Inhibitors. ACS Med Chem Lett 8:1213-1217 (2017)  
Target
Name:
Carbonic anhydrase 7
Synonyms:
CA-VII CAH7_HUMAN Carbonic anhydrase Carbonic anhydrase VII (CA VII)
Type:
Enzyme
Mol. Mass.:
29664.11
Organism:
Homo sapiens (Human)
Description:
Human cloned isozyme.
Residue:
264
  
Inhibitor
Name:
BDBM50279712
Synonyms:
CHEMBL4172182
Type:
Small organic molecule
Emp. Form.:
C12H17NO3SSe
Mol. Mass.:
334.29
SMILES:
[#7]S(=O)(=O)c1ccc([Se;v2][#6]-2-[#6]-[#6]-[#6]-[#6]-[#6]-2-[#8])cc1
: