Target
Carbonic anhydrase 7
Ligand
BDBM50279714
Substrate
Meas. Tech.
ChEMBL_1721602 (CHEMBL4136602)
Ki
0.350000±n/a nM
Citation
 Angeli, ATanini, DCapperucci, ASupuran, CT Synthesis of Novel Selenides Bearing Benzenesulfonamide Moieties as Carbonic Anhydrase I, II, IV, VII, and IX Inhibitors. ACS Med Chem Lett 8:1213-1217 (2017)  
Target
Name:
Carbonic anhydrase 7
Synonyms:
CA-VII CAH7_HUMAN Carbonic anhydrase Carbonic anhydrase VII (CA VII)
Type:
Enzyme
Mol. Mass.:
29664.11
Organism:
Homo sapiens (Human)
Description:
Human cloned isozyme.
Residue:
264
  
Inhibitor
Name:
BDBM50279714
Synonyms:
CHEMBL4162168
Type:
Small organic molecule
Emp. Form.:
C18H24N2O4S2Se
Mol. Mass.:
475.48
SMILES:
[#6]-[#6](-[#6])-[#6@@H](-[#6][Se;v2]c1ccc(cc1)S([#7])(=O)=O)-[#7]S(=O)(=O)c1ccc(-[#6])cc1
: