Target
Carbonic anhydrase 2
Ligand
BDBM50279697
Substrate
Meas. Tech.
ChEMBL_1721600 (CHEMBL4136600)
Ki
0.180000±n/a nM
Citation
 Angeli, ATanini, DCapperucci, ASupuran, CT Synthesis of Novel Selenides Bearing Benzenesulfonamide Moieties as Carbonic Anhydrase I, II, IV, VII, and IX Inhibitors. ACS Med Chem Lett 8:1213-1217 (2017)  
Target
Name:
Carbonic anhydrase 2
Synonyms:
CA-II CAC Carbonate dehydratase II Carbonic anhydrase 2 (CA-II) Carbonic anhydrase C Carbonic anhydrase II (CA-II) Carbonic anhydrase II (hCA II) | Carbonic anhydrase isoenzyme II (hCA II)
Type:
Enzyme
Mol. Mass.:
29250.71
Organism:
Homo sapiens (Human)
Description:
P00918
Residue:
260
  
Inhibitor
Name:
BDBM50279697
Synonyms:
CHEMBL4164295
Type:
Small organic molecule
Emp. Form.:
C16H23NO3SSe
Mol. Mass.:
388.38
SMILES:
[#6]-[#6](=[#6])-[#6@@H]-1-[#6]-[#6]C([#6])([#8])[#6](-[#6]-1)[Se;v2]c1ccc(cc1)S([#7])(=O)=O
: