Target
C-X-C chemokine receptor type 4
Ligand
BDBM50286298
Substrate
Meas. Tech.
ChEMBL_1729032 (CHEMBL4144310)
IC50
6.0±n/a nM
Citation
 Wilson, RJJecs, EMiller, EJNguyen, HHTahirovic, YATruax, VMKim, MBKuo, KMWang, TSum, CSCvijic, MEPaiva, AASchroeder, GMWilson, LJLiotta, DC Synthesis and SAR of 1,2,3,4-Tetrahydroisoquinoline-Based CXCR4 Antagonists. ACS Med Chem Lett 9:17-22 (2018)  
Target
Name:
C-X-C chemokine receptor type 4
Synonyms:
C-X-C chemokine receptor type 4 CD_antigen=CD184 CXCR-4 CXCR4_HUMAN Fusin LCR1 Leukocyte-derived seven transmembrane domain receptor SDF-1 receptor | Stromal cell-derived factor 1 receptor
Type:
Enzyme
Mol. Mass.:
39754.61
Organism:
Homo sapiens (Human)
Description:
P61073
Residue:
352
  
Inhibitor
Name:
BDBM50286298
Synonyms:
CHEMBL4171469
Type:
Small organic molecule
Emp. Form.:
C22H30N4O
Mol. Mass.:
366.4998
SMILES:
NCCCCN(C[C@H]1Cc2ccccc2CN1)[C@H]1CCOc2cccnc12
: