Target
Neutrophil elastase
Ligand
BDBM50129952
Substrate
Meas. Tech.
ChEMBL_1729324 (CHEMBL4144602)
IC50
1270±n/a nM
Citation
 Ayoub, IMKorinek, MHwang, TLChen, BHChang, FREl-Shazly, MSingab, ANB Probing the Antiallergic and Anti-inflammatory Activity of Biflavonoids and Dihydroflavonols from Dietes bicolor. J Nat Prod 81:243-253 (2018)  
Target
Name:
Neutrophil elastase
Synonyms:
Bone marrow serine protease Coagulation factor X ELANE Elastase HLE Leukocyte elastase Medullasin Neutrophil elastase (HNE) PMN elastase Trypsin
Type:
Enzyme
Mol. Mass.:
28532.38
Organism:
Homo sapiens (Human)
Description:
P08246
Residue:
267
  
Inhibitor
Name:
BDBM50129952
Synonyms:
2-(3-(5,7-dihydroxy-2-(4-hydroxyphenyl)-4-oxo-4H-chromen-8-yl)-4-hydroxyphenyl)-5,7-dihydroxy-4H-chromen-4-one Amentoflavone cid_5281600
Type:
Small organic molecule
Emp. Form.:
C30H18O10
Mol. Mass.:
538.4579
SMILES:
Oc1ccc(cc1)-c1cc(=O)c2c(O)cc(O)c(-c3cc(ccc3O)-c3cc(O)c4c(cc(O)cc4=O)o3)c2o1
: