Target
Neutrophil elastase
Ligand
BDBM50323212
Substrate
Meas. Tech.
ChEMBL_1729324 (CHEMBL4144602)
IC50
1330±n/a nM
Citation
 Ayoub, IMKorinek, MHwang, TLChen, BHChang, FREl-Shazly, MSingab, ANB Probing the Antiallergic and Anti-inflammatory Activity of Biflavonoids and Dihydroflavonols from Dietes bicolor. J Nat Prod 81:243-253 (2018)  
Target
Name:
Neutrophil elastase
Synonyms:
Bone marrow serine protease Coagulation factor X ELANE Elastase HLE Leukocyte elastase Medullasin Neutrophil elastase (HNE) PMN elastase Trypsin
Type:
Enzyme
Mol. Mass.:
28532.38
Organism:
Homo sapiens (Human)
Description:
P08246
Residue:
267
  
Inhibitor
Name:
BDBM50323212
Synonyms:
6-[5-(5,7-Dihydroxy-4-oxo-4H-chromen-2-yl)-2-hydroxy-phenyl]-5,7-dihydroxy-2-(4-hydroxy-phenyl)-chromen-4-one ROBUSTAFLAVONE
Type:
Small organic molecule
Emp. Form.:
C30H18O10
Mol. Mass.:
538.4579
SMILES:
Oc1ccc(cc1)-c1cc(=O)c2c(O)c(c(O)cc2o1)-c1cc(ccc1O)-c1cc(O)c2c(cc(O)cc2=O)o1
: