Target
C-X-C chemokine receptor type 4
Ligand
BDBM50286782
Substrate
Meas. Tech.
ChEMBL_1729567 (CHEMBL4144845)
IC50
6.40±n/a nM
Citation
 Jecs, EMiller, EJWilson, RJNguyen, HHTahirovic, YAKatzman, BMTruax, VMKim, MBKuo, KMWang, TSum, CSCvijic, MESchroeder, GMWilson, LJLiotta, DC Synthesis of Novel Tetrahydroisoquinoline CXCR4 Antagonists with Rigidified Side-Chains. ACS Med Chem Lett 9:89-93 (2018)  
Target
Name:
C-X-C chemokine receptor type 4
Synonyms:
C-X-C chemokine receptor type 4 CD_antigen=CD184 CXCR-4 CXCR4_HUMAN Fusin LCR1 Leukocyte-derived seven transmembrane domain receptor SDF-1 receptor | Stromal cell-derived factor 1 receptor
Type:
Enzyme
Mol. Mass.:
39754.61
Organism:
Homo sapiens (Human)
Description:
P61073
Residue:
352
  
Inhibitor
Name:
BDBM50286782
Synonyms:
CHEMBL4163770
Type:
Small organic molecule
Emp. Form.:
C24H32N4
Mol. Mass.:
376.5377
SMILES:
NCC1CC1CN(C[C@H]1Cc2ccccc2CN1)[C@H]1CCCc2cccnc12
: