Target
Beta-1 adrenergic receptor
Ligand
BDBM50292219
Substrate
Meas. Tech.
ChEMBL_1729838 (CHEMBL4145116)
Ki
5.4±n/a nM
Citation
 Nocentini, ACeruso, MBua, SLomelino, CLAndring, JTMcKenna, RLanzi, CSgambellone, SPecori, RMatucci, RFilippi, LGratteri, PCarta, FMasini, ESelleri, SSupuran, CT Discovery of ?-Adrenergic Receptors Blocker-Carbonic Anhydrase Inhibitor Hybrids for Multitargeted Antiglaucoma Therapy. J Med Chem 61:5380-5394 (2018)  
Target
Name:
Beta-1 adrenergic receptor
Synonyms:
ADRB1 ADRB1_HUMAN Beta-1 adrenoceptor adrenergic Beta1
Type:
G Protein-Coupled Receptor (GPCR)
Mol. Mass.:
51338.40
Organism:
Homo sapiens (Human)
Description:
P08588
Residue:
477
  
Inhibitor
Name:
BDBM50292219
Synonyms:
(-)-3-morpholino-4-(3-tert-butylamino-2-hydroxypropoxy)-1,2,5-thiadiazole (2S)-1-(tert-butylamino)-3-[(4-morpholin-4-yl-1,2,5-thiadiazol-3-yl)oxy]propan-2-ol (S)-1-(tert-butylamino)-3-((4-morpholino-1,2,5-thiadiazol-3-yl)oxy)propan-2-ol CHEMBL499 TIMOLOL
Type:
Small organic molecule
Emp. Form.:
C13H24N4O3S
Mol. Mass.:
316.42
SMILES:
CC(C)(C)NC[C@H](O)COc1nsnc1N1CCOCC1
: