Target
Homeodomain-interacting protein kinase 1
Ligand
BDBM50400734
Substrate
Meas. Tech.
ChEMBL_1730339 (CHEMBL4145875)
IC50
0.367000±n/a nM
Citation
 Farag, AKElkamhawy, ALondhe, AMLee, KTPae, ANRoh, EJ Novel LCK/FMS inhibitors based on phenoxypyrimidine scaffold as potential treatment for inflammatory disorders. Eur J Med Chem 141:657-675 (2017)  
Target
Name:
Homeodomain-interacting protein kinase 1
Synonyms:
HIPK1 Homeodomain-interacting protein kinase 1 (HIPK1) MYAK | NBAK2
Type:
PROTEIN
Mol. Mass.:
130868.34
Organism:
Homo sapiens (Human)
Description:
ChEMBL_1459267
Residue:
1210
  
Inhibitor
Name:
BDBM50400734
Synonyms:
CHEMBL1591531
Type:
Small organic molecule
Emp. Form.:
C25H23N5O2S
Mol. Mass.:
457.547
SMILES:
Cn1cc(C2=C(C(=O)NC2=O)c2cn(CCCSC(N)=N)c3ccccc23)c2ccccc12
: