Target
Prolyl hydroxylase EGLN3
Ligand
BDBM50446903
Substrate
Meas. Tech.
ChEBML_1733869
IC50
1.000000±n/a nM
Citation
 Joharapurkar, AAPandya, VBPatel, VJDesai, RCJain, MR Prolyl Hydroxylase Inhibitors: A Breakthrough in the Therapy of Anemia Associated with Chronic Diseases. J Med Chem 61:6964-6982 (2018)  
Target
Name:
Prolyl hydroxylase EGLN3
Synonyms:
EGLN3 Egl nine homolog 3 (EGLIN3) | Egl nine homolog 3 (EGLN3)
Type:
Protein
Mol. Mass.:
27265.54
Organism:
Homo sapiens (Human)
Description:
Q9H6Z9
Residue:
239
  
Inhibitor
Name:
BDBM50446903
Synonyms:
CHEMBL3115293
Type:
Small organic molecule
Emp. Form.:
C21H17ClN4O4S2
Mol. Mass.:
488.967
SMILES:
COc1ccc(nc1OC)-n1c(=S)[nH]c2cc(sc2c1=O)C(=O)NCc1ccc(Cl)cc1
: