Target
Prolyl hydroxylase EGLN2
Ligand
BDBM50385806
Substrate
Meas. Tech.
ChEMBL_1733868 (CHEMBL4149404)
IC50
0.200000±n/a nM
Citation
 Joharapurkar, AAPandya, VBPatel, VJDesai, RCJain, MR Prolyl Hydroxylase Inhibitors: A Breakthrough in the Therapy of Anemia Associated with Chronic Diseases. J Med Chem 61:6964-6982 (2018)  
Target
Name:
Prolyl hydroxylase EGLN2
Synonyms:
EGLN2 EIT6 Estrogen-induced tag 6 HIF-PH1 HPH-3 PHD1 Prolyl hydroxylase domain-containing protein 1 (PHD1)
Type:
Protein
Mol. Mass.:
43657.01
Organism:
Homo sapiens (Human)
Description:
Q96KS0
Residue:
407
  
Inhibitor
Name:
BDBM50385806
Synonyms:
CHEMBL2041193
Type:
Small organic molecule
Emp. Form.:
C32H30N6O4
Mol. Mass.:
562.6184
SMILES:
Cc1cccnc1CN1CCC2(CC1)N(C(=O)N(C2=O)c1ccc(cc1)-c1ccc(cc1C)C(O)=O)c1ccncn1
: