Target
Carbonic anhydrase 5B, mitochondrial
Ligand
BDBM50279713
Substrate
Meas. Tech.
ChEMBL_1734318 (CHEMBL4149854)
Ki
5.7±n/a nM
Citation
 Angeli, Adi Cesare Mannelli, LTrallori, EPeat, TSGhelardini, CCarta, FSupuran, CT Design, Synthesis, and X-ray of Selenides as New Class of Agents for Prevention of Diabetic Cerebrovascular Pathology. ACS Med Chem Lett 9:462-467 (2018)  
Target
Name:
Carbonic anhydrase 5B, mitochondrial
Synonyms:
CA-VB CAH5B_HUMAN Carbonic Anhydrase VB Carbonic anhydrase 5B, mitochondrial Carbonic anhydrase V | Carbonic anhydrase VB (CA VB)
Type:
Enzyme
Mol. Mass.:
36440.83
Organism:
Homo sapiens (Human)
Description:
Human (cloned) isozyme
Residue:
317
  
Inhibitor
Name:
BDBM50279713
Synonyms:
CHEMBL4159870
Type:
Small organic molecule
Emp. Form.:
C7H6N2O2SSe
Mol. Mass.:
261.16
SMILES:
[#7]S(=O)(=O)c1ccc([Se;v2]C#N)cc1
: