Target
C-X-C chemokine receptor type 4
Ligand
BDBM50315305
Substrate
Meas. Tech.
ChEBML_1734263
IC50
5±n/a nM
Citation
 Tahirovic, YATruax, VMWilson, RJJecs, ENguyen, HHMiller, EJKim, MBKuo, KMWang, TSum, CSCvijic, MESchroeder, GMWilson, LJLiotta, DC Discovery of  ACS Med Chem Lett 9:446-451 (2018)  
Target
Name:
C-X-C chemokine receptor type 4
Synonyms:
C-X-C chemokine receptor type 4 CD_antigen=CD184 CXCR-4 CXCR4_HUMAN Fusin LCR1 Leukocyte-derived seven transmembrane domain receptor SDF-1 receptor | Stromal cell-derived factor 1 receptor
Type:
Enzyme
Mol. Mass.:
39754.61
Organism:
Homo sapiens (Human)
Description:
P61073
Residue:
352
  
Inhibitor
Name:
BDBM50315305
Synonyms:
(S)-N-((1H-benzo[d]imidazol-2-yl)methyl)-N-(4-aminobutyl)-5,6,7,8-tetrahydroquinolin-8-amine CHEMBL518924
Type:
Small organic molecule
Emp. Form.:
C21H27N5
Mol. Mass.:
349.4726
SMILES:
NCCCCN(Cc1nc2ccccc2[nH]1)[C@H]1CCCc2cccnc12
: