Target
Potassium voltage-gated channel subfamily H member 2
Ligand
BDBM198694
Substrate
Meas. Tech.
ChEMBL_1734340 (CHEMBL4149876)
IC50
400±n/a nM
Citation
 Marcin, LRWarrier, JThangathirupathy, SShi, JKarageorge, GNPearce, BCNg, APark, HKempson, JLi, JZhang, HMathur, AReddy, ABNagaraju, GTonukunuru, GGupta, GVRKMKamble, MMannoori, RCheruku, SJogi, SGulia, JBastia, TSanmathi, CAher, JKallem, RSrikumar, BNVijaya, KKNaidu, PSPaschapur, MKalidindi, NVikramadithyan, RRamarao, MDenton, RMolski, TShields, ESubramanian, MZhuo, XNophsker, MSimmermacher, JSinz, MAlbright, CBristow, LJIslam, IBronson, JJOlson, REKing, DThompson, LAMacor, JE BMS-986163, a Negative Allosteric Modulator of GluN2B with Potential Utility in Major Depressive Disorder. ACS Med Chem Lett 9:472-477 (2018)  
Target
Name:
Potassium voltage-gated channel subfamily H member 2
Synonyms:
1,3-beta-glucan synthase component GLS2 ERG Eag-related protein 1 Ether-a-go-go-related gene (HERG) Ether-a-go-go-related gene potassium channel 1 Ether-a-go-go-related gene potassium channel 1 (hERG1) Ether-a-go-go-related protein 1 H-ERG KCNH2 Potassium voltage-gated channel subfamily H member 2 (hERG) Voltage-gated potassium channel subunit Kv11.1 hERG Potassium Channel 1 | putative potassium channel subunit
Type:
Multi-pass membrane protein
Mol. Mass.:
126672.65
Organism:
Homo sapiens (Human)
Description:
Q12809
Residue:
1159
  
Inhibitor
Name:
BDBM198694
Synonyms:
US9221796, 23b
Type:
Small organic molecule
Emp. Form.:
C23H28N2O2
Mol. Mass.:
364.4806
SMILES:
Cc1ccc(CN2CC[C@@H](N3CCC(CC3)c3ccc(O)cc3)C2=O)cc1
: