Target
Telomeric repeat-binding factor 2
Ligand
BDBM50338560
Substrate
Meas. Tech.
ChEMBL_1734477 (CHEMBL4150013)
Ki
11300±n/a nM
Citation
 Chen, XLiu, LChen, YYang, YYang, CYGuo, TLei, MSun, HWang, S Cyclic Peptidic Mimetics of Apollo Peptides Targeting Telomeric Repeat Binding Factor 2 (TRF2) and Apollo Interaction. ACS Med Chem Lett 9:507-511 (2018)  
Target
Name:
Telomeric repeat-binding factor 2
Synonyms:
TERF2 TRBF2 TTAGGG repeat-binding factor 2 Telomeric repeat-binding factor 2
Type:
PROTEIN
Mol. Mass.:
59608.94
Organism:
Homo sapiens
Description:
ChEMBL_118257
Residue:
542
  
Inhibitor
Name:
BDBM50338560
Synonyms:
CHEMBL4174183
Type:
Small organic molecule
Emp. Form.:
C58H98N12O13
Mol. Mass.:
1171.4713
SMILES:
CC[C@H](C)[C@H](NC(=O)[C@H](CC(C)C)NC(=O)[C@H](Cc1ccc(O)cc1)NC(=O)[C@H](CCCCN)NC(=O)[C@H](CC(C)C)NC(=O)[C@H](C)NC(=O)[C@H](CC(C)C)NC(C)=O)C(=O)N[C@@H]([C@@H](C)O)C(=O)N1CCC[C@H]1C(=O)N[C@@H](C(C)C)C(N)=O
: