Target
Telomeric repeat-binding factor 2
Ligand
BDBM50338580
Substrate
Meas. Tech.
ChEMBL_1734477 (CHEMBL4150013)
Ki
380±n/a nM
Citation
 Chen, XLiu, LChen, YYang, YYang, CYGuo, TLei, MSun, HWang, S Cyclic Peptidic Mimetics of Apollo Peptides Targeting Telomeric Repeat Binding Factor 2 (TRF2) and Apollo Interaction. ACS Med Chem Lett 9:507-511 (2018)  
Target
Name:
Telomeric repeat-binding factor 2
Synonyms:
TERF2 TRBF2 TTAGGG repeat-binding factor 2 Telomeric repeat-binding factor 2
Type:
PROTEIN
Mol. Mass.:
59608.94
Organism:
Homo sapiens
Description:
ChEMBL_118257
Residue:
542
  
Inhibitor
Name:
BDBM50338580
Synonyms:
CHEMBL4163072
Type:
Small organic molecule
Emp. Form.:
C58H98N12O14
Mol. Mass.:
1187.4707
SMILES:
CC(C)C[C@H](NC(=O)CN)C(=O)N[C@@H](C)C(=O)N[C@@H](CC(C)C)C(=O)N[C@@H](CCCCN)C(=O)N[C@@H](Cc1ccc(O)cc1)C(=O)N[C@@H](CC(C)C)C(=O)N[C@@H](CC(C)C)C(=O)N[C@@H]([C@@H](C)O)C(=O)N1CCC[C@H]1C(=O)N[C@@H](C(C)C)C(O)=O
: