Target
Thymidylate synthase
Ligand
BDBM50011243
Substrate
Meas. Tech.
ChEBML_210160
IC50
160±n/a nM
Citation
 Jones, TRThornton, TJFlinn, AJackman, ALNewell, DRCalvert, AH Quinazoline antifolates inhibiting thymidylate synthase: 2-desamino derivatives with enhanced solubility and potency. J Med Chem 32:847-52 (1989)  
Target
Name:
Thymidylate synthase
Synonyms:
TSase Thymidylate Synthase (TS) thyA
Type:
Enzyme
Mol. Mass.:
36576.54
Organism:
Lactobacillus casei
Description:
Residue:
316
  
Inhibitor
Name:
BDBM50011243
Synonyms:
2-{4-[(4-Hydroxy-quinazolin-6-ylmethyl)-prop-2-ynyl-amino]-benzoylamino}-pentanedioic acid CHEMBL171480
Type:
Small organic molecule
Emp. Form.:
C24H22N4O6
Mol. Mass.:
462.4547
SMILES:
OC(=O)CCC(NC(=O)c1ccc(cc1)N(CC#C)Cc1ccc2nc[nH]c(=O)c2c1)C(O)=O
: