Target
Thymidylate synthase
Ligand
BDBM50017876
Substrate
Meas. Tech.
ChEBML_210160
IC50
60±n/a nM
Citation
 Jones, TRThornton, TJFlinn, AJackman, ALNewell, DRCalvert, AH Quinazoline antifolates inhibiting thymidylate synthase: 2-desamino derivatives with enhanced solubility and potency. J Med Chem 32:847-52 (1989)  
Target
Name:
Thymidylate synthase
Synonyms:
TSase Thymidylate Synthase (TS) thyA
Type:
Enzyme
Mol. Mass.:
36576.54
Organism:
Lactobacillus casei
Description:
Residue:
316
  
Inhibitor
Name:
BDBM50017876
Synonyms:
2-{4-[(2-Amino-4-oxo-3,4-dihydro-quinazolin-6-ylmethyl)-ethyl-amino]-benzoylamino}-pentanedioic acid | CHEMBL22632
Type:
Small organic molecule
Emp. Form.:
C23H25N5O6
Mol. Mass.:
467.4745
SMILES:
CCN(Cc1ccc2nc(N)[nH]c(=O)c2c1)c1ccc(cc1)C(=O)NC(CCC(O)=O)C(O)=O
: