Target
Dihydrofolate reductase
Ligand
BDBM50006907
Substrate
Meas. Tech.
ChEMBL_55290 (CHEMBL875022)
Ki
11±n/a nM
Citation
 Jones, TRThornton, TJFlinn, AJackman, ALNewell, DRCalvert, AH Quinazoline antifolates inhibiting thymidylate synthase: 2-desamino derivatives with enhanced solubility and potency. J Med Chem 32:847-52 (1989)  
Target
Name:
Dihydrofolate reductase
Synonyms:
DYR_RAT Dihydrofolate reductase (DHFR) Tetrahydrofolate dehydrogenase
Type:
Enzyme
Mol. Mass.:
21638.84
Organism:
Rattus norvegicus (rat)
Description:
Residue:
187
  
Inhibitor
Name:
BDBM50006907
Synonyms:
2-{4-[(4-Oxo-3,4-dihydro-quinazolin-6-ylmethyl)-amino]-benzoylamino}-pentanedioic acid | CHEMBL89641
Type:
Small organic molecule
Emp. Form.:
C21H20N4O6
Mol. Mass.:
424.4067
SMILES:
OC(=O)CCC(NC(=O)c1ccc(NCc2ccc3nc[nH]c(=O)c3c2)cc1)C(O)=O
: