Target
Thymidylate synthase
Ligand
BDBM50017877
Substrate
Meas. Tech.
ChEBML_209958
IC50
1060±n/a nM
Citation
 Jones, TRThornton, TJFlinn, AJackman, ALNewell, DRCalvert, AH Quinazoline antifolates inhibiting thymidylate synthase: 2-desamino derivatives with enhanced solubility and potency. J Med Chem 32:847-52 (1989)  
Target
Name:
Thymidylate synthase
Synonyms:
TS TYSY_MOUSE | Tyms
Type:
PROTEIN
Mol. Mass.:
34957.15
Organism:
Mus musculus
Description:
ChEMBL_1340097
Residue:
307
  
Inhibitor
Name:
BDBM50017877
Synonyms:
2-{4-[Methyl-(4-oxo-3,4-dihydro-quinazolin-6-ylmethyl)-amino]-benzoylamino}-pentanedioic acid | CHEMBL355712
Type:
Small organic molecule
Emp. Form.:
C22H22N4O6
Mol. Mass.:
438.4333
SMILES:
CN(Cc1ccc2nc[nH]c(=O)c2c1)c1ccc(cc1)C(=O)NC(CCC(O)=O)C(O)=O
: