Target
Macrophage metalloelastase
Ligand
BDBM50265157
Substrate
Meas. Tech.
ChEMBL_1735783 (CHEMBL4151319)
Ki
30±n/a nM
Citation
 Mahasenan, KVDing, DGao, MNguyen, TTSuckow, MASchroeder, VAWolter, WRChang, MMobashery, S In Search of Selectivity in Inhibition of ADAM10. ACS Med Chem Lett 9:708-713 (2018)  
Target
Name:
Macrophage metalloelastase
Synonyms:
HME MMP12_HUMAN Matrix metalloproteinase-12 (MMP 12) Matrix metalloproteinase-12 (MMP12) | Matrix metalloproteinases 12 (MMP-12)
Type:
Enzyme
Mol. Mass.:
54012.99
Organism:
Homo sapiens (Human)
Description:
P39900
Residue:
470
  
Inhibitor
Name:
BDBM50265157
Synonyms:
(6S,7S)-N-hydroxy-5-methyl-6-(4-(5-(trifluoromethyl)pyridin-2-yl)piperazine-1-carbonyl)-5-azaspiro[2.5]octane-7-carboxamide | CHEMBL497985
Type:
Small organic molecule
Emp. Form.:
C20H26F3N5O3
Mol. Mass.:
441.4473
SMILES:
CN1CC2(CC2)C[C@@H]([C@H]1C(=O)N1CCN(CC1)c1ccc(cn1)C(F)(F)F)C(=O)NO
: