Target
17-beta-hydroxysteroid dehydrogenase 14
Ligand
BDBM50422425
Substrate
Meas. Tech.
ChEMBL_1739715 (CHEMBL4155465)
Ki
1.5±n/a nM
Citation
 Braun, FBertoletti, NMöller, GAdamski, JFrotscher, MGuragossian, NMadeira Gírio, PALe Borgne, MEttouati, LFalson, PMüller, SVollmer, GHeine, AKlebe, GMarchais-Oberwinkler, S Structure-based design and profiling of novel 17?-HSD14 inhibitors. Eur J Med Chem 155:61-76 (2018)  
Target
Name:
17-beta-hydroxysteroid dehydrogenase 14
Synonyms:
17-beta-HSD 14 17-beta-hydroxysteroid dehydrogenase DHRS10 DHRS10 Dehydrogenase/reductase SDR family member 10 Retinal short-chain dehydrogenase/reductase retSDR3 SDR47C1 | Short chain dehydrogenase/reductase family 47C member 1
Type:
PROTEIN
Mol. Mass.:
28316.15
Organism:
Homo sapiens (Human)
Description:
ChEMBL_114829
Residue:
270
  
Inhibitor
Name:
BDBM50422425
Synonyms:
CHEMBL4175585
Type:
Small organic molecule
Emp. Form.:
C19H13F2NO2
Mol. Mass.:
325.3088
SMILES:
Oc1cc(ccc1F)C(=C)c1cccc(n1)-c1cccc(O)c1F
: