Target
Adenosine receptor A1
Ligand
BDBM50291815
Substrate
Meas. Tech.
ChEBML_28990
Ki
1000000±n/a nM
Citation
 Schneller, SWIbay, ACChrist, WJBruns, RF Linear and proximal benzo-separated alkylated xanthines as adenosine-receptor antagonists. J Med Chem 32:2247-54 (1989)  
Target
Name:
Adenosine receptor A1
Synonyms:
AA1R_RAT ADENOSINE A1 high Adenosine A1 receptor (A1) Adenosine receptors A1 | Adora1
Type:
Protein
Mol. Mass.:
36704.13
Organism:
Rattus norvegicus (rat)
Description:
Residue:
326
  
Inhibitor
Name:
BDBM50291815
Synonyms:
1,3,9-Trimethyl-3,9-dihydro-purine-2,6-dione | CHEMBL74063
Type:
Small organic molecule
Emp. Form.:
C8H10N4O2
Mol. Mass.:
194.1906
SMILES:
Cn1cnc2c1n(C)c(=O)n(C)c2=O
: