Target
Mu-type opioid receptor
Ligand
BDBM50018635
Substrate
Meas. Tech.
ChEBML_147107
IC50
632±n/a nM
Citation
 Schiller, PWNguyen, TMMaziak, LAWilkes, BCLemieux, C Structure-activity relationships of cyclic opioid peptide analogues containing a phenylalanine residue in the 3-position. J Med Chem 30:2094-9 (1987)  
Target
Name:
Mu-type opioid receptor
Synonyms:
M-OR-1 Mu opioid receptor OPIATE Mu OPRM_CAVPO
Type:
Enzyme Catalytic Domain
Mol. Mass.:
11165.58
Organism:
GUINEA PIG
Description:
P97266
Residue:
98
  
Inhibitor
Name:
BDBM50018635
Synonyms:
12-[2-Amino-3-(4-hydroxy-phenyl)-propionylamino]-2-benzyl-3,7,13-trioxo-1,4,8triaza-cyclotridecane-5-carboxylic acid amide | CHEMBL303513
Type:
Small organic molecule
Emp. Form.:
C27H34N6O6
Mol. Mass.:
538.5955
SMILES:
N[C@@H](Cc1ccc(O)cc1)C(=O)N[C@@H]1CCCNC(=O)C[C@@H](NC(=O)[C@H](Cc2ccccc2)NC1=O)C(N)=O
: