Target
C-X-C chemokine receptor type 4
Ligand
BDBM50449948
Substrate
Meas. Tech.
ChEMBL_1741061 (CHEMBL4156811)
IC50
2.9±n/a nM
Citation
 Nguyen, HHKim, MBWilson, RJButch, CJKuo, KMMiller, EJTahirovic, YAJecs, ETruax, VMWang, TSum, CSCvijic, MESchroeder, GMWilson, LJLiotta, DC Design, Synthesis, and Pharmacological Evaluation of Second-Generation Tetrahydroisoquinoline-Based CXCR4 Antagonists with Favorable ADME Properties. J Med Chem 61:7168-7188 (2018)  
Target
Name:
C-X-C chemokine receptor type 4
Synonyms:
C-X-C chemokine receptor type 4 CD_antigen=CD184 CXCR-4 CXCR4_HUMAN Fusin LCR1 Leukocyte-derived seven transmembrane domain receptor SDF-1 receptor | Stromal cell-derived factor 1 receptor
Type:
Enzyme
Mol. Mass.:
39754.61
Organism:
Homo sapiens (Human)
Description:
P61073
Residue:
352
  
Inhibitor
Name:
BDBM50449948
Synonyms:
CHEMBL4173977
Type:
Small organic molecule
Emp. Form.:
C27H37N5
Mol. Mass.:
431.6162
SMILES:
[H][C@@]12CCCN1CCN(C2)c1cccc2CN[C@@H](CN(C)[C@H]3CCCc4cccnc34)Cc12
: