Target
Endothelial PAS domain-containing protein 1
Ligand
BDBM372988
Substrate
Meas. Tech.
ChEMBL_1742627 (CHEMBL4158377)
EC50
380±n/a nM
Citation
 Wehn, PMRizzi, JPDixon, DDGrina, JASchlachter, STWang, BXu, RYang, HDu, XHan, GWang, KCao, ZCheng, TCzerwinski, RMGoggin, BSHuang, HHalfmann, MMMaddie, MAMorton, ELOlive, SRTan, HXie, SWong, TJosey, JAWallace, EM Design and Activity of Specific Hypoxia-Inducible Factor-2? (HIF-2?) Inhibitors for the Treatment of Clear Cell Renal Cell Carcinoma: Discovery of Clinical Candidate ( S)-3-((2,2-Difluoro-1-hydroxy-7-(methylsulfonyl)-2,3-dihydro-1 H-inden-4-yl)oxy)-5-fluorobenzonitrile (PT2385). J Med Chem 61:9691-9721 (2018)  
Target
Name:
Endothelial PAS domain-containing protein 1
Synonyms:
BHLHE73 EPAS1_HUMAN MOP2 endothelial PAS domain-containing protein 1
Type:
PROTEIN
Mol. Mass.:
96453.58
Organism:
Homo sapiens (Human)
Description:
ChEMBL_1506501
Residue:
870
  
Inhibitor
Name:
BDBM372988
Synonyms:
US10597366, Compound 41 | US9896418, Compound 41
Type:
Small organic molecule
Emp. Form.:
C14H9Cl2F3O4S
Mol. Mass.:
401.185
SMILES:
OCc1c(Cl)c(Oc2cc(F)cc(Cl)c2)ccc1S(=O)(=O)C(F)F
: