Target
Transient receptor potential cation channel subfamily V member 1
Ligand
BDBM176555
Substrate
Meas. Tech.
ChEMBL_1744480 (CHEMBL4178990)
Ki
0.040000±n/a nM
Citation
 Lee, SKim, CAnn, JThorat, SAKim, EPark, JChoi, SBlumberg, PMFrank-Foltyn, RBahrenberg, GStockhausen, HChristoph, TLee, J Pyrazole C-region analogues of 2-(3-fluoro-4-methylsulfonylaminophenyl)propanamides as potent TRPV1 antagonists. Bioorg Med Chem Lett 27:4383-4388 (2017)  
Target
Name:
Transient receptor potential cation channel subfamily V member 1
Synonyms:
Capsaicin receptor Osm-9-like TRP channel 1 TRPV1_HUMAN Transient receptor potential cation channel subfamily V member 1 (TRPV1) Transient receptor potential cation channel subfamily V member 1(TRPV1) Vanilloid VR1 Vanilloid receptor 1 Vanilloid receptor 1 (VRI/TRPV1)
Type:
Protein
Mol. Mass.:
94960.75
Organism:
Homo sapiens (Human)
Description:
Q8NER1
Residue:
839
  
Inhibitor
Name:
BDBM176555
Synonyms:
US9120756, 17
Type:
Small organic molecule
Emp. Form.:
C24H28ClFN4O3S
Mol. Mass.:
507.021
SMILES:
C[C@H](C(=O)NCc1cc(nn1-c1cccc(Cl)c1)C(C)(C)C)c1ccc(NS(C)(=O)=O)c(F)c1
: