Target
Peroxisome proliferator-activated receptor alpha
Ligand
BDBM323597
Substrate
Meas. Tech.
ChEMBL_1747072 (CHEMBL4181582)
EC50
>10000±n/a nM
Citation
 Lagu, BKluge, AFFredenburg, RATozzo, ESenaiar, RSJaleel, MPanigrahi, SKTiwari, NKKrishnamurthy, NRTakahashi, TPatane, MA Novel highly selective peroxisome proliferator-activated receptor ? (PPAR?) modulators with pharmacokinetic properties suitable for once-daily oral dosing. Bioorg Med Chem Lett 27:5230-5234 (2017)  
Target
Name:
Peroxisome proliferator-activated receptor alpha
Synonyms:
NR1C1 PPAR PPAR-alpha PPARA_HUMAN Peroxisome proliferator-activated receptor | Peroxisome proliferator-activated receptor alpha (PPAR alpha)
Type:
Enzyme
Mol. Mass.:
52222.08
Organism:
Homo sapiens (Human)
Description:
Q07869
Residue:
468
  
Inhibitor
Name:
BDBM323597
Synonyms:
(E)-6-(2-((4-(furan-2-yl)-N-methylbenzamido)methyl)phenoxy)-3-methylhex-2-enoic acid | US10188627, Compound 8i
Type:
Small organic molecule
Emp. Form.:
C26H27NO5
Mol. Mass.:
433.4963
SMILES:
CN(Cc1ccccc1OCCC\C(C)=C\C(O)=O)C(=O)c1ccc(cc1)-c1ccco1
: