Target
Peroxisome proliferator-activated receptor delta
Ligand
BDBM323597
Substrate
Meas. Tech.
ChEMBL_1747068 (CHEMBL4181578)
EC50
690±n/a nM
Citation
 Lagu, BKluge, AFFredenburg, RATozzo, ESenaiar, RSJaleel, MPanigrahi, SKTiwari, NKKrishnamurthy, NRTakahashi, TPatane, MA Novel highly selective peroxisome proliferator-activated receptor ? (PPAR?) modulators with pharmacokinetic properties suitable for once-daily oral dosing. Bioorg Med Chem Lett 27:5230-5234 (2017)  
Target
Name:
Peroxisome proliferator-activated receptor delta
Synonyms:
NR1C2 NUCI Nuclear receptor subfamily 1 group C member 2 PPAR-beta PPARD Peroxisome proliferator-activated receptor Peroxisome proliferator-activated receptor delta
Type:
Enzyme
Mol. Mass.:
49910.45
Organism:
Homo sapiens (Human)
Description:
Q03181
Residue:
441
  
Inhibitor
Name:
BDBM323597
Synonyms:
(E)-6-(2-((4-(furan-2-yl)-N-methylbenzamido)methyl)phenoxy)-3-methylhex-2-enoic acid | US10188627, Compound 8i
Type:
Small organic molecule
Emp. Form.:
C26H27NO5
Mol. Mass.:
433.4963
SMILES:
CN(Cc1ccccc1OCCC\C(C)=C\C(O)=O)C(=O)c1ccc(cc1)-c1ccco1
: