Target
Atrial natriuretic peptide receptor 1
Ligand
BDBM50452473
Substrate
Meas. Tech.
ChEMBL_1747592 (CHEMBL4182102)
EC50
160±n/a nM
Citation
 Iwaki, TTanaka, TMiyazaki, KSuzuki, YOkamura, YYamaki, AIwanami, MMorozumi, NFuruya, MOyama, Y Discovery and in vivo effects of novel human natriuretic peptide receptor A (NPR-A) agonists with improved activity for rat NPR-A. Bioorg Med Chem 25:6680-6694 (2017)  
Target
Name:
Atrial natriuretic peptide receptor 1
Synonyms:
4.6.1.2 ANPR-A Atrial natriuretic peptide receptor 1 GC-A NPR-A | Npr1
Type:
PROTEIN
Mol. Mass.:
118956.96
Organism:
Rattus norvegicus
Description:
ChEMBL_18039
Residue:
1057
  
Inhibitor
Name:
BDBM50452473
Synonyms:
CHEMBL4205804
Type:
Small organic molecule
Emp. Form.:
C28H37FN6O2
Mol. Mass.:
508.6308
SMILES:
COC[C@@H](C)Nc1nc(N[C@@H]2CC[C@@H](CC2)NC(=O)NC(C)C)c2cc(ccc2n1)-c1cccc(F)c1
: