Target
Atrial natriuretic peptide receptor 1
Ligand
BDBM50452451
Substrate
Meas. Tech.
ChEMBL_1747591 (CHEMBL4182101)
EC50
220±n/a nM
Citation
 Iwaki, TTanaka, TMiyazaki, KSuzuki, YOkamura, YYamaki, AIwanami, MMorozumi, NFuruya, MOyama, Y Discovery and in vivo effects of novel human natriuretic peptide receptor A (NPR-A) agonists with improved activity for rat NPR-A. Bioorg Med Chem 25:6680-6694 (2017)  
Target
Name:
Atrial natriuretic peptide receptor 1
Synonyms:
ANP-A ANPRA_HUMAN Atrial natriuretic peptide receptor GC-A NPR-A | NPR1
Type:
PROTEIN
Mol. Mass.:
118919.35
Organism:
Homo sapiens (Human)
Description:
ChEMBL_700223
Residue:
1061
  
Inhibitor
Name:
BDBM50452451
Synonyms:
CHEMBL4210772
Type:
Small organic molecule
Emp. Form.:
C28H37FN6O3
Mol. Mass.:
524.6302
SMILES:
C[C@H](CO)Nc1nc(N[C@@H]2CC[C@@H](CC2)NC(=O)NC(C)(C)CO)c2cc(ccc2n1)-c1cccc(F)c1
: