Target
Pyruvate kinase PKM
Ligand
BDBM23411
Substrate
Meas. Tech.
ChEMBL_1747643 (CHEMBL4182153)
IC50
12500±n/a nM
Citation
 You, LZhu, HWang, CWang, FLi, YLi, YWang, YHe, B Scutellarin inhibits Hela cell growth and glycolysis by inhibiting the activity of pyruvate kinase M2. Bioorg Med Chem Lett 27:5404-5408 (2017)  
Target
Name:
Pyruvate kinase PKM
Synonyms:
KPYM_HUMAN PK2 PKM Pyruvate kinase (PKM2)
Type:
Protein
Mol. Mass.:
57944.31
Organism:
Homo sapiens (Human)
Description:
P14618
Residue:
531
  
Inhibitor
Name:
BDBM23411
Synonyms:
5,6,7-trihydroxy-2-(4-hydroxyphenyl)-4H-chromen-4-one Scutellarein Scutellarein (28) | US10252984, Table 2.2
Type:
flavone
Emp. Form.:
C15H10O6
Mol. Mass.:
286.2363
SMILES:
Oc1ccc(cc1)-c1cc(=O)c2c(O)c(O)c(O)cc2o1
: