Target
D(2) dopamine receptor
Ligand
BDBM50020178
Substrate
Meas. Tech.
ChEBML_63037
Ki
7.1±n/a nM
Citation
 van Wijngaarden, IKruse, CGvan der Heyden, JATulp, MT 2-Phenylpyrroles as conformationally restricted benzamide analogues. A new class of potential antipsychotics. 2. J Med Chem 31:1934-40 (1988)  
Target
Name:
D(2) dopamine receptor
Synonyms:
DOPAMINE D2 DOPAMINE D2 Short Dopamine D2 receptor Drd2
Type:
G Protein-Coupled Receptor (GPCR)
Mol. Mass.:
50931.60
Organism:
Rattus norvegicus (rat)
Description:
P61169
Residue:
444
  
Inhibitor
Name:
BDBM50020178
Synonyms:
CHEMBL294633 N-[2-(4-Benzofuran-7-yl-piperazin-1-yl)-ethyl]-4-fluoro-benzamide
Type:
Small organic molecule
Emp. Form.:
C21H22FN3O2
Mol. Mass.:
367.4167
SMILES:
Fc1ccc(cc1)C(=O)NCCN1CCN(CC1)c1cccc2ccoc12
: