Target
Histone acetyltransferase p300
Ligand
BDBM50453820
Substrate
Meas. Tech.
ChEMBL_1750745 (CHEMBL4185505)
Ki
400±n/a nM
Citation
 Buuh, ZYLyu, ZWang, RE Interrogating the Roles of Post-Translational Modifications of Non-Histone Proteins. J Med Chem 61:3239-3252 (2018)  
Target
Name:
Histone acetyltransferase p300
Synonyms:
EP300 HIF1A/p300/CREB-binding protein P300
Type:
Protein
Mol. Mass.:
264223.04
Organism:
Homo sapiens (Human)
Description:
Q09472
Residue:
2414
  
Inhibitor
Name:
BDBM50453820
Synonyms:
CHEMBL4208500
Type:
Small organic molecule
Emp. Form.:
C24H19N3O6
Mol. Mass.:
445.4242
SMILES:
CC1=NN(C(=O)C1=Cc1ccc(o1)-c1cc(C)c(C)cc1[N+]([O-])=O)c1ccc(cc1)C(O)=O
: