Target
Cyclin-dependent kinase/G2/mitotic-specific cyclin- 1
Ligand
BDBM50454182
Substrate
Meas. Tech.
ChEMBL_1752190 (CHEMBL4186950)
IC50
3200±n/a nM
Citation
 Cherukupalli, SHampannavar, GAChinnam, SChandrasekaran, BSayyad, NKayamba, FReddy Aleti, RKarpoormath, R An appraisal on synthetic and pharmaceutical perspectives of pyrazolo[4,3-d]pyrimidine scaffold. Bioorg Med Chem 26:309-339 (2018)  
Target
Name:
Cyclin-dependent kinase/G2/mitotic-specific cyclin- 1
Synonyms:
CDK1/B CDK1/CyclinB Cyclin-Dependent Kinase 1 (CDK1) Cyclin-dependent kinase/G2/mitotic-specific cyclin 1 | cdk1
Type:
Protein Complex
Mol. Mass.:
Description:
CDK1/Cyclin B complexes were purified from insect cells co-infected with baculovirus vectors containing each of the components.
Components:
This complex has 2 components.
Component 1
Name:
Cyclin-dependent kinase 1
Synonyms:
CDC2 CDK1 CDKN1 Cell division protein kinase 1 P34CDC2 | p34 protein kinase
Type:
Enzyme Subunit
Mol. Mass.:
34101.08
Organism:
Homo sapiens (Human)
Description:
P06493
Residue:
297
  
Component 2
Name:
G2/mitotic-specific cyclin-B1
Synonyms:
CCNB CCNB1_HUMAN
Type:
Enzyme Subunit
Mol. Mass.:
48340.95
Organism:
Homo sapiens (Human)
Description:
P14635
Residue:
433
  
Inhibitor
Name:
BDBM50454182
Synonyms:
CHEMBL4210771
Type:
Small organic molecule
Emp. Form.:
C21H29N7
Mol. Mass.:
379.5019
SMILES:
CC(C)c1n[nH]c2c(NCc3ccccc3)nc(NC3CCCCC3N)nc12
: