Target
Cyclin-A2/Cyclin-dependent kinase 2
Ligand
BDBM50454182
Substrate
Meas. Tech.
ChEMBL_1752191 (CHEMBL4186951)
IC50
990±n/a nM
Citation
 Cherukupalli, SHampannavar, GAChinnam, SChandrasekaran, BSayyad, NKayamba, FReddy Aleti, RKarpoormath, R An appraisal on synthetic and pharmaceutical perspectives of pyrazolo[4,3-d]pyrimidine scaffold. Bioorg Med Chem 26:309-339 (2018)  
Target
Name:
Cyclin-A2/Cyclin-dependent kinase 2
Synonyms:
CDK2-CyclinA CDK2/Cyclin A Cyclin A2/dependent kinase 2 Cyclin-Dependent Kinase 2 (CDK2A)
Type:
Protein Complex
Mol. Mass.:
Description:
Cdk2/Cyclin A kinase was purified from insect cells coinfected with Cyclin A/Cdk2 baculovirus.
Components:
This complex has 2 components.
Component 1
Name:
Cyclin-dependent kinase 2
Synonyms:
CDK2 CDK2_HUMAN Cell division protein kinase 2 Protein cereblon/Cyclin-dependent kinase 2 | p33 protein kinase
Type:
Enzyme Subunit
Mol. Mass.:
33938.17
Organism:
Homo sapiens (Human)
Description:
P24941
Residue:
298
  
Component 2
Name:
Cyclin-A2
Synonyms:
CCN1 CCNA1 CCNA2_HUMAN Cyclin-A
Type:
Enzyme Subunit
Mol. Mass.:
48550.19
Organism:
Homo sapiens (Human)
Description:
P20248
Residue:
432
  
Inhibitor
Name:
BDBM50454182
Synonyms:
CHEMBL4210771
Type:
Small organic molecule
Emp. Form.:
C21H29N7
Mol. Mass.:
379.5019
SMILES:
CC(C)c1n[nH]c2c(NCc3ccccc3)nc(NC3CCCCC3N)nc12
: