Target
Cyclin-dependent kinase 5 activator 1
Ligand
BDBM50454182
Substrate
Meas. Tech.
ChEMBL_1752193 (CHEMBL4186953)
IC50
440±n/a nM
Citation
 Cherukupalli, SHampannavar, GAChinnam, SChandrasekaran, BSayyad, NKayamba, FReddy Aleti, RKarpoormath, R An appraisal on synthetic and pharmaceutical perspectives of pyrazolo[4,3-d]pyrimidine scaffold. Bioorg Med Chem 26:309-339 (2018)  
Target
Name:
Cyclin-dependent kinase 5 activator 1
Synonyms:
CDK5/p35 Cyclin-dependent kinase 5 regulatory subunit 1 | Cyclin-dependent kinase 5/CDK5 activator 1
Type:
Protein Complex
Mol. Mass.:
Description:
Components:
This complex has 2 components.
Component 1
Name:
Cyclin-dependent kinase 5
Synonyms:
CDK5 CDKN5 Cyclin-dependent kinase 5 (CDK5/ p25) Cyclin-dependent-like kinase 5 PSSALRE Tau protein kinase II catalytic subunit
Type:
Enzyme Subunit
Mol. Mass.:
33308.61
Organism:
Homo sapiens (Human)
Description:
Residue:
292
  
Component 2
Name:
Cyclin-dependent kinase 5 activator 1
Synonyms:
CD5R1_HUMAN CDK5R1 Cyclin-dependent kinase 5 (CDK5/p25) NCK5A p35
Type:
Enzyme Subunit
Mol. Mass.:
34077.43
Organism:
Homo sapiens (Human)
Description:
Q15078
Residue:
307
  
Inhibitor
Name:
BDBM50454182
Synonyms:
CHEMBL4210771
Type:
Small organic molecule
Emp. Form.:
C21H29N7
Mol. Mass.:
379.5019
SMILES:
CC(C)c1n[nH]c2c(NCc3ccccc3)nc(NC3CCCCC3N)nc12
: