Target
Cyclin-dependent kinase 4/G1/S-specific cyclin-D1
Ligand
BDBM50454182
Substrate
Meas. Tech.
ChEMBL_1752192 (CHEMBL4186952)
IC50
15000±n/a nM
Citation
 Cherukupalli, SHampannavar, GAChinnam, SChandrasekaran, BSayyad, NKayamba, FReddy Aleti, RKarpoormath, R An appraisal on synthetic and pharmaceutical perspectives of pyrazolo[4,3-d]pyrimidine scaffold. Bioorg Med Chem 26:309-339 (2018)  
Target
Name:
Cyclin-dependent kinase 4/G1/S-specific cyclin-D1
Synonyms:
CDK4/CycD CDK4/Cyclin D1 Cyclin-Dependent Kinase 4 (CDK4) Cyclin-dependent kinase 4/G1/S-specific cyclin D1 | Cyclin-dependent kinase 4/cyclin D1
Type:
Protein Complex
Mol. Mass.:
Description:
CDK4/D1 complexes were purified from insect cells co-infected with baculovirus vectors containing each of the components.
Components:
This complex has 2 components.
Component 1
Name:
Cyclin-dependent kinase 4
Synonyms:
CDK4 Cell division protein kinase 4 PSK-J3
Type:
Enzyme Subunit
Mol. Mass.:
33731.96
Organism:
Homo sapiens (Human)
Description:
P11802
Residue:
303
  
Component 2
Name:
G1/S-specific cyclin-D1
Synonyms:
B-cell lymphoma 1 protein BCL-1 oncogene CCND1 PRAD1 | PRAD1 oncogene
Type:
Enzyme Subunit
Mol. Mass.:
33717.70
Organism:
Homo sapiens (Human)
Description:
Residue:
295
  
Inhibitor
Name:
BDBM50454182
Synonyms:
CHEMBL4210771
Type:
Small organic molecule
Emp. Form.:
C21H29N7
Mol. Mass.:
379.5019
SMILES:
CC(C)c1n[nH]c2c(NCc3ccccc3)nc(NC3CCCCC3N)nc12
: