Target
Midkine
Ligand
BDBM50454868
Substrate
Meas. Tech.
ChEMBL_1753624 (CHEMBL4188384)
IC50
>250000±n/a nM
Citation
 Maza, SGandia-Aguado, Nde Paz, JLNieto, PM Fluorous-tag assisted synthesis of a glycosaminoglycan mimetic tetrasaccharide as a high-affinity FGF-2 and midkine ligand. Bioorg Med Chem 26:1076-1085 (2018)  
Target
Name:
Midkine
Synonyms:
ARAP MDK MK1 Midgestation and kidney protein Neurite outgrowth-promoting factor 2 | Neurite outgrowth-promoting protein
Type:
PROTEIN
Mol. Mass.:
15605.71
Organism:
Homo sapiens (Human)
Description:
ChEMBL_805023
Residue:
143
  
Inhibitor
Name:
BDBM50454868
Synonyms:
CHEMBL4203669
Type:
Small organic molecule
Emp. Form.:
C21H31NO18S2
Mol. Mass.:
649.597
SMILES:
COc1ccc(O[C@@H]2O[C@H](CO)[C@@H](O[C@@H]3O[C@H](COS(O)(=O)=O)[C@@H](OS(O)(=O)=O)[C@H](O)[C@H]3NC(C)=O)[C@H](O)[C@H]2O)cc1
: