Target
Midkine
Ligand
BDBM50454864
Substrate
Meas. Tech.
ChEMBL_1753624 (CHEMBL4188384)
IC50
1300±n/a nM
Citation
 Maza, SGandia-Aguado, Nde Paz, JLNieto, PM Fluorous-tag assisted synthesis of a glycosaminoglycan mimetic tetrasaccharide as a high-affinity FGF-2 and midkine ligand. Bioorg Med Chem 26:1076-1085 (2018)  
Target
Name:
Midkine
Synonyms:
ARAP MDK MK1 Midgestation and kidney protein Neurite outgrowth-promoting factor 2 | Neurite outgrowth-promoting protein
Type:
PROTEIN
Mol. Mass.:
15605.71
Organism:
Homo sapiens (Human)
Description:
ChEMBL_805023
Residue:
143
  
Inhibitor
Name:
BDBM50454864
Synonyms:
CHEMBL4202957
Type:
Small organic molecule
Emp. Form.:
C82H82F6N2O40S4
Mol. Mass.:
1977.768
SMILES:
[H][C@@]1(O[C@H]2[C@H](OCc3ccccc3)[C@@H](OC(=O)c3ccccc3)[C@]([H])(O[C@H]3[C@H](OS(O)(=O)=O)[C@@H](COS(O)(=O)=O)O[C@@]([H])(O[C@H]4[C@H](OCc5ccccc5)[C@@H](OC(=O)c5ccccc5)[C@H](Oc5ccc(OC)cc5)O[C@@H]4C(=O)OCc4ccccc4)[C@@H]3NC(=O)C(F)(F)F)O[C@@H]2C(=O)OCc2ccccc2)O[C@H](COS(O)(=O)=O)[C@@H](OS(O)(=O)=O)[C@H](OC(=O)CCC(C)=O)[C@H]1NC(=O)C(F)(F)F
: