Target
Transcription initiation factor TFIID subunit 1-like
Ligand
BDBM50455480
Substrate
Meas. Tech.
ChEMBL_1754572 (CHEMBL4189332)
Kd
<30200±n/a nM
Citation
 Law, RPAtkinson, SJBamborough, PChung, CWDemont, EHGordon, LJLindon, MPrinjha, RKWatson, AJBHirst, DJ Discovery of Tetrahydroquinoxalines as Bromodomain and Extra-Terminal Domain (BET) Inhibitors with Selectivity for the Second Bromodomain. J Med Chem 61:4317-4334 (2018)  
Target
Name:
Transcription initiation factor TFIID subunit 1-like
Synonyms:
TAF(II)210 TAF1L_HUMAN TBP-associated factor 210 kDa Transcription initiation factor TFIID subunit 1-like
Type:
PROTEIN
Mol. Mass.:
207253.07
Organism:
Homo sapiens (Human)
Description:
ChEMBL_108001
Residue:
1826
  
Inhibitor
Name:
BDBM50455480
Synonyms:
CHEMBL4218735
Type:
Small organic molecule
Emp. Form.:
C26H31N3O2
Mol. Mass.:
417.5432
SMILES:
CC(=O)N1[C@H](CN(Cc2ccccc2CO)c2cc(ccc12)C1=CCNCC1)C1CC1
: