Target
Protein kinase C iota type
Ligand
BDBM50455566
Substrate
Meas. Tech.
ChEMBL_1754791 (CHEMBL4189551)
IC50
30±n/a nM
Citation
 Kwiatkowski, JLiu, BTee, DHYChen, GAhmad, NHBWong, YXPoh, ZYAng, SHTan, ESWOng, EHNurul Dinie, naPoulsen, APendharkar, VSangthongpitag, KLee, MASepramaniam, SHo, SYCherian, JHill, JKeller, THHung, AW Fragment-Based Drug Discovery of Potent Protein Kinase C Iota Inhibitors. J Med Chem 61:4386-4396 (2018)  
Target
Name:
Protein kinase C iota type
Synonyms:
Atypical protein kinase C-lambda/iota KPCI_HUMAN PRKCI Protein kinase C iota Protein kinase C iota type aPKC-lambda/iota | nPKC-iota
Type:
Enzyme
Mol. Mass.:
68251.56
Organism:
Homo sapiens (Human)
Description:
P41743
Residue:
596
  
Inhibitor
Name:
BDBM50455566
Synonyms:
CHEMBL4208028
Type:
Small organic molecule
Emp. Form.:
C22H18N6O
Mol. Mass.:
382.4179
SMILES:
COc1cc2CNCc2cc1-n1cnc2cnc(cc12)-c1ccnc2[nH]ccc12
: