Target
Inosine-5'-monophosphate dehydrogenase
Ligand
BDBM50456068
Substrate
Meas. Tech.
ChEMBL_1755126 (CHEMBL4189886)
Ki
1100±n/a nM
Citation
 Chacko, SBoshoff, HIMSingh, VFerraris, DMGollapalli, DRZhang, MLawson, APPepi, MJJoachimiak, ARizzi, MMizrahi, VCuny, GDHedstrom, L Expanding Benzoxazole-Based Inosine 5'-Monophosphate Dehydrogenase (IMPDH) Inhibitor Structure-Activity As Potential Antituberculosis Agents. J Med Chem 61:4739-4756 (2018)  
Target
Name:
Inosine-5'-monophosphate dehydrogenase
Synonyms:
1.1.1.205 IMP dehydrogenase IMPDH guaB | guaB2
Type:
PROTEIN
Mol. Mass.:
54865.42
Organism:
Mycobacterium tuberculosis (strain ATCC 25618 / H37Rv)
Description:
ChEMBL_117831
Residue:
529
  
Inhibitor
Name:
BDBM50456068
Synonyms:
CHEMBL4208344
Type:
Small organic molecule
Emp. Form.:
C23H16F2N4O2
Mol. Mass.:
418.3955
SMILES:
C[C@H](Nc1cccc(F)c1F)C(=O)Nc1ccc2oc(nc2c1)-c1ccc(cc1)C#N
: