Target
Inosine-5'-monophosphate dehydrogenase
Ligand
BDBM50456082
Substrate
Meas. Tech.
ChEMBL_1755126 (CHEMBL4189886)
Ki
13000±n/a nM
Citation
 Chacko, SBoshoff, HIMSingh, VFerraris, DMGollapalli, DRZhang, MLawson, APPepi, MJJoachimiak, ARizzi, MMizrahi, VCuny, GDHedstrom, L Expanding Benzoxazole-Based Inosine 5'-Monophosphate Dehydrogenase (IMPDH) Inhibitor Structure-Activity As Potential Antituberculosis Agents. J Med Chem 61:4739-4756 (2018)  
Target
Name:
Inosine-5'-monophosphate dehydrogenase
Synonyms:
1.1.1.205 IMP dehydrogenase IMPDH guaB | guaB2
Type:
PROTEIN
Mol. Mass.:
54865.42
Organism:
Mycobacterium tuberculosis (strain ATCC 25618 / H37Rv)
Description:
ChEMBL_117831
Residue:
529
  
Inhibitor
Name:
BDBM50456082
Synonyms:
CHEMBL4211507
Type:
Small organic molecule
Emp. Form.:
C26H22Cl2N2O6
Mol. Mass.:
529.369
SMILES:
CCOC(=O)COc1ccc(cc1)-c1nc2cc(NC(=O)[C@H](C)Oc3cccc(Cl)c3Cl)ccc2o1
: