Target
Inosine-5'-monophosphate dehydrogenase
Ligand
BDBM50456083
Substrate
Meas. Tech.
ChEMBL_1755126 (CHEMBL4189886)
Ki
>15000±n/a nM
Citation
 Chacko, SBoshoff, HIMSingh, VFerraris, DMGollapalli, DRZhang, MLawson, APPepi, MJJoachimiak, ARizzi, MMizrahi, VCuny, GDHedstrom, L Expanding Benzoxazole-Based Inosine 5'-Monophosphate Dehydrogenase (IMPDH) Inhibitor Structure-Activity As Potential Antituberculosis Agents. J Med Chem 61:4739-4756 (2018)  
Target
Name:
Inosine-5'-monophosphate dehydrogenase
Synonyms:
1.1.1.205 IMP dehydrogenase IMPDH guaB | guaB2
Type:
PROTEIN
Mol. Mass.:
54865.42
Organism:
Mycobacterium tuberculosis (strain ATCC 25618 / H37Rv)
Description:
ChEMBL_117831
Residue:
529
  
Inhibitor
Name:
BDBM50456083
Synonyms:
CHEMBL4213733
Type:
Small organic molecule
Emp. Form.:
C23H16Cl2N2O5
Mol. Mass.:
471.29
SMILES:
C[C@H](Oc1cccc(Cl)c1Cl)C(=O)Nc1ccc2oc(nc2c1)-c1ccc(cc1)C(O)=O
: