Target
Inosine-5'-monophosphate dehydrogenase
Ligand
BDBM50432798
Substrate
Meas. Tech.
ChEMBL_1755126 (CHEMBL4189886)
Ki
>50000±n/a nM
Citation
 Chacko, SBoshoff, HIMSingh, VFerraris, DMGollapalli, DRZhang, MLawson, APPepi, MJJoachimiak, ARizzi, MMizrahi, VCuny, GDHedstrom, L Expanding Benzoxazole-Based Inosine 5'-Monophosphate Dehydrogenase (IMPDH) Inhibitor Structure-Activity As Potential Antituberculosis Agents. J Med Chem 61:4739-4756 (2018)  
Target
Name:
Inosine-5'-monophosphate dehydrogenase
Synonyms:
1.1.1.205 IMP dehydrogenase IMPDH guaB | guaB2
Type:
PROTEIN
Mol. Mass.:
54865.42
Organism:
Mycobacterium tuberculosis (strain ATCC 25618 / H37Rv)
Description:
ChEMBL_117831
Residue:
529
  
Inhibitor
Name:
BDBM50432798
Synonyms:
CHEMBL2348814
Type:
Small organic molecule
Emp. Form.:
C22H19N3O4
Mol. Mass.:
389.404
SMILES:
COc1ccc(OC(C)C(=O)Nc2ccc3oc(nc3c2)-c2ccncc2)cc1
: