Target
Acid ceramidase
Ligand
BDBM319796
Substrate
Meas. Tech.
ChEMBL_1758531 (CHEMBL4193539)
IC50
9.0±n/a nM
Citation
 Li, YChen, QYang, LLi, YZhang, YQiu, YRen, JLu, C Identification of highly potent N-acylethanolamine acid amidase (NAAA) inhibitors: Optimization of the terminal phenyl moiety of oxazolidone derivatives. Eur J Med Chem 139:214-221 (2017)  
Target
Name:
Acid ceramidase
Synonyms:
AC ASAH1_RAT Acid ceramidase Acylsphingosine deacylase N-acylsphingosine amidohydrolase
Type:
Enzyme
Mol. Mass.:
44450.22
Organism:
Rattus norvegicus (Rat)
Description:
Q6P7S1
Residue:
394
  
Inhibitor
Name:
BDBM319796
Synonyms:
US10174015, Compound 9
Type:
Small organic molecule
Emp. Form.:
C15H18ClNO3
Mol. Mass.:
295.761
SMILES:
Clc1cccc(CCCCCC(=O)N2CCOC2=O)c1
: